{"text_format":"1","workbook":"xlsx","n_sheets":4,"sheets":["Qüestionari","Full1","Full2","Full3"],"not_rendered":{"charts":0,"images":0,"macros":1,"external_links":0,"defined_names":1,"comments":1,"pivot_tables":0},"unopened":[],"bounds":{"document_bytes":16777216,"sheet_cells":100000,"rows_first":2000,"rows_last":500,"rows_between":2000,"halvings":0,"cell_chars":16384,"cell_head_chars":4096},"cells_cut":0,"cells_raw":0,"read":"whole","date_system":"1900"}

{"sheet":"Qüestionari","index":0,"n_rows":356,"n_cols":7,"rows_kept":356,"cut":false,"hidden":false,"merged":[[12,2,13,3],[1,2,1,4],[6,2,8,3],[9,2,11,3],[4,2,5,3],[301,3,309,4],[310,3,318,4],[319,3,327,4],[328,3,336,4],[337,3,345,4],[346,3,354,4],[355,3,363,4],[301,2,302,2],[155,2,155,4],[161,2,161,4],[288,2,288,4],[291,2,291,4],[295,2,295,4],[254,2,254,4],[260,2,260,4],[265,2,265,4],[267,2,267,4],[269,2,269,4],[271,2,271,4],[273,2,273,4],[276,2,276,4],[25,2,25,4],[28,2,28,4],[32,2,32,4],[53,2,53,4],[69,2,69,4],[120,2,120,4],[127,2,127,4],[136,2,136,4],[140,2,140,4],[146,2,146,4],[189,2,189,4],[193,2,193,4],[200,2,200,4],[212,2,212,4],[222,2,222,4],[16,2,16,4],[22,2,22,4],[74,2,74,4],[279,2,279,4],[83,2,83,4],[92,2,92,4],[103,2,103,4],[108,2,108,4],[149,2,149,4],[235,2,235,4],[246,2,246,4],[164,2,164,4],[168,2,168,4],[178,2,178,4],[184,2,184,4],[230,2,230,4]]}
[]
[null,null,"Qüestionari per situacions de risc"]
[]
[null,null,"Instruccions:"]
[null,null,"(1) Empleneu les caselles d'edat de l'infant (entre 0 i 17 anys) i nivell educatiu (caselles a la dreta amb fons groc). El nivell educatiu és un llistat desplegable.",null,"Edat de l'infant"]
[]
[null,null,"(2) Responeu amb \"Si\" o \"No\" exclusivament a les preguntes marcades amb asterisc, en negreta i fons verd (per defecte, es mostra la resposta \"No\"). A la resta, deixeu la resposta \"No\". Les preguntes a respondre depenen de l'edat introduïda. El rang d'edat pel qual s'ha de respondre a la pregunta apareix, a títol informatiu, al final de les preguntes."]
[null,null,null,null,"Nivell Educatiu"]
[]
[null,null,"(3) Al final del qüestionari us apareixeran les accions a realitzar, sempre i quan l'edat i el nivell educatiu estiguin introduïts. Les accions a realitzar depenen del nivell educatiu introduït i les respostes donades."]
[]
[]
[null,null,"(4) Si voleu esborrar les dades, cliqueu el botó \"Esborrar dades\". Totes les respostes del qüestionari tornaran a l'estat \"No\" i l'edat de l'infant i nivell educatiu s'esborraran."]
[]
[]
[null,null,"Núm.","Element avaluat","Resposta"]
[null,null,"A1. Higiene de l’infant"]
[null,{"$f":"IF(AND($E$6<>\"\",$E$9<>\"\",$F18<=$E$6,$G18>=$E$6),\"*\",\"\")","v":""},{"$f":"CONCATENATE(\"A1-\",IF(RIGHT(LEFT(Qüestionari!$D18,2),1)=\"\",\"0\",\"\"),IF(RIGHT(LEFT(Qüestionari!$D18,2),1)=\"\",LEFT(Qüestionari!$D18,1),LEFT(Qüestionari!$D18,2)))","v":"A1-1 "},"1 Porta la roba bruta 0‐17","No",{"$f":"0","v":0},{"$f":"17","v":17}]
[null,{"$f":"IF(AND($E$6<>\"\",$E$9<>\"\",$F19<=$E$6,$G19>=$E$6),\"*\",\"\")","v":""},{"$f":"CONCATENATE(LEFT(C18,2),\"-\",IF(RIGHT(LEFT(Qüestionari!$D19,2),1)=\"\",0,\"\"),IF(RIGHT(LEFT(Qüestionari!$D19,2),1)=\"\",LEFT(Qüestionari!$D19,1),LEFT(Qüestionari!$D19,2)))","v":"A1-2 "},"2 Presenta olors desagradables 3‐17","No",{"$f":"3","v":3},{"$f":"17","v":17}]
[null,"",{"$f":"CONCATENATE(LEFT(C19,2),\"-\",IF(RIGHT(LEFT(Qüestionari!$D20,2),1)=\"\",0,\"\"),IF(RIGHT(LEFT(Qüestionari!$D20,2),1)=\"\",LEFT(Qüestionari!$D20,1),LEFT(Qüestionari!$D20,2)))","v":"A1-3 "},"3 Porta roba i/o calçat inadequats 0‐17","No",{"$f":"0","v":0},{"$f":"17","v":17}]
{"$rows_left_out":337}
{"sheet":"Full1","index":1,"n_rows":317,"n_cols":41,"rows_kept":317,"cut":false,"hidden":true,"merged":[]}
[]
[]
[null,null,null,null,null,null,null,null,null,"Si"]
[null,null,null,null,null,null,null,null,null,"No"]
[]
[null,null,null,null,null,null,null,null,null,"Infantil"]
[null,null,null,null,null,null,null,null,null,"Primària"]
[null,null,null,null,null,null,null,null,null,"Secundària"]
[null,null,null,null,null,null,null,null,null,"Postobligatòria"]
[]
[]
[]
[]
[]
[]
[]
[null,"Columna1","Resposta","Condició","Acció","Columna5",null,"Núm.",null,"Accions",null,null,null,null,"Tipus","S'activa?",{"$f":"CONCATENATE(Q18,Q19)","v":""}]
[null,"A1. La higiene de l’infant és deficient",{"$f":"IFERROR(VLOOKUP(Taula1[[#This Row],[Columna1]],Qüestionari!D:E,2,FALSE),\"\")","v":""},null,"VERSIÓ 18/12/2017",null,null,1,null,"Activació protocol maltractament greu",1,null,null,null,"Maltractament",{"$f":"IF(OR(C221=\"Si\",C226=\"Si\",C259=\"Si\",C265=\"Si\",C202=\"Si\",C39=\"Si\",C50=\"Si\",C51=\"Si\",C79=\"Si\",C80=\"Si\",C85=\"Si\",C103=\"Si\",C181=\"Si\",C236=\"Si\",C45=\"Si\",C46=\"Si\",C53=\"Si\",AND(C58=\"Si\",OR(C57=\"Si\",C56=\"Si\")),C61=\"Si\",C62=\"Si\",C63=\"Si\",C64=\"Si\",C65=\"Si\",C66=\"Si\",C74=\"Si\",C147=\"Si\",C231=\"Si\",C235=\"Si\"),\"Si\",\"No\")","v":"No"},{"$f":"IFERROR(IFERROR(VLOOKUP(\"X1\",I:K,3,FALSE),VLOOKUP(\"X1\",L:N,3,FALSE)),\"\")","v":""},{"$f":"IF(P18=\"Si\",J18,IF(P19=\"Si\",J19,IF(P25=\"Si\",J25,IF(P33=\"Si\",J33,IF(P24=\"Si\",J24,IF(P30=\"Si\",J30,IF(P20=\"Si\",J20,\"\")))))))","v":""},{"$f":"IF(AND(R18=J19,P33=\"Si\"),M19,IF(AND(R18=J25,P33=\"Si\"),M25,R18))","v":""},null,null,null,{"$f":"IF(S18=J18,S18,IF(S18=J20,J20,IF(Q18=\"\",IF(Q19=\"\",\"\",S19),IF(S19<>\"\",VLOOKUP(Q17,Q22:T56,4,FALSE),S18))))","v":""},{"$f":"IF(W18<>\"\",CONCATENATE(\"Actuacions en l'àmbit d'un possible maltractament: \",CHAR(10),W18),IF(Qüestionari!E301>=1,CONCATENATE(\"Actuacions en l'àmbit d'un possible maltractament: \",CHAR(10),\"Entrevista del tutor/a amb la família. Omplir, si escau, el full d'indicadors per valorar si és un cas per portar a la Comissió Social (centre públic). Valorar derivació a Serveis Socials (centre concertat)\"),\"\"))","v":""},{"$f":"IF(X18=\"\",X19,X18)","v":""},{"$f":"IF(Y18=\"\",Y19,Y18)","v":""},"","","","",0,0,0,0,0,0,{"$f":"IF(AJ18=\"\",AJ19,AJ18)","v":0},0,0,0,0]
[null,"1 Porta la roba bruta 0‐17",{"$f":"IFERROR(VLOOKUP(Taula1[[#This Row],[Columna1]],Qüestionari!D:E,2,FALSE),\"\")","v":"No"},null,"Llegendes:",null,null,2,{"$f":"IF(J19=$S$18,\"x1\",\"\")","v":""},"Anar a hospital i informar a la família. En funció de la informació que es tingui (via: família, UDEPMI, TS hospital,...) i de l'informe mèdic:\n- Si l'hospital activa el protocol greu = activació greu\n- Si l'hospital NO activa el protocol greu però a l'informe es descriuen les lesions = activació greu","2.1",{"$f":"IF(M19=$S$18,\"x1\",\"\")","v":""},"Anar a hospital i informar a la família. En funció de la informació que es tingui (via: família, UDEPMI, TS hospital,...) i de l'informe mèdic:\n- Si l'hospital activa el protocol greu o l'informe explicita maltractament = activació greu\n- Si l'hospital NO activa el protocol greu però a l'informe es descriuen les lesions = activació greu","2.2","Maltractament",{"$f":"IF(AND(OR(C28=\"Si\",C36=\"Si\",C37=\"Si\",C38=\"Si\",C40=\"Si\",C41=\"Si\",C42=\"Si\"),OR(C45=\"Si\",C46=\"Si\")),\"Si\",\"No\")","v":"No"},{"$f":"IFERROR(IFERROR(VLOOKUP(\"X2\",I:K,3,FALSE),VLOOKUP(\"X2\",L:N,3,FALSE)),\"\")","v":""},{"$f":"IF(P20=\"Si\",\"\",IF(P21=\"Si\",J21,IF(P28=\"Si\",J28,IF(P27=\"Si\",J27,IF(P29=\"Si\",J29,\"\")))))","v":""},{"$f":"IF(AND(R19=J28,P27=\"Si\"),M28,R19)","v":""},null,null,null,{"$f":"IF(P23=\"Si\",J23,IF(P22=\"Si\",\"Activació protocol emergències psicosocials. Informar l'EAP per a que valori el cas i decideixi si es deriva o no a CSMIJ.\",IF(P34=\"si\",J34,\"\")))","v":""},{"$f":"IF(W19<>\"\",CONCATENATE(\"Actuacions en l'àmbit de la salut mental: \",CHAR(10),W19),\"\")","v":""},{"$f":"IF(OR(X19=\"\",Y18=X19,X19=0),X20,X19)","v":""},{"$f":"IF(OR(Y19=\"\",Z18=Y19,Y19=0),Y20,Y19)","v":""},"","","",0,0,0,0,0,0,0,{"$f":"IF(OR(AJ19=\"\",AK18=AJ19,AJ19=0),AJ20,AJ19)","v":0},{"$f":"IF(OR(AK19=\"\",AL18=AK19,AK19=0),AK20,AK19)","v":0},{"$f":"IF(OR(AL19=\"\",AM18=AL19,AL19=0),AL20,AL19)","v":0},{"$f":"IF(OR(AM19=\"\",AN18=AM19,AM19=0),AM20,AM19)","v":0},{"$f":"IF(OR(AN19=\"\",AO18=AN19,AN19=0),AN20,AN19)","v":0}]
[null,"2 Presenta olors desagradables 3‐17",{"$f":"IFERROR(VLOOKUP(Taula1[[#This Row],[Columna1]],Qüestionari!D:E,2,FALSE),\"\")","v":"No"},null,"Activació de maltractament greu",null,null,3,null,"La direcció del centre oferirà omplir instància relatant els fets i s'enviarà al CEB i s'engegaran les actuacions acordades en aquesta situació específica",3,null,null,null,"Maltractament",{"$f":"IF(AND(OR(C67=\"Si\",C68=\"Si\"),C56=\"No\",C57=\"No\",C58=\"No\",C59=\"No\",C60=\"No\",C61=\"No\",C62=\"No\",C63=\"No\",C64=\"No\",C65=\"No\",C66=\"No\"),\"Si\",\"No\")","v":"No"},null,null,null,null,null,null,{"$f":"IF(P26=\"Si\",J26,\"\")","v":""},{"$f":"IF(W20<>\"\",CONCATENATE(\"Actuacions en l'àmbit d'un possible assetjament: \",CHAR(10),W20),\"\")","v":""},{"$f":"IF(OR(X20=\"\",Y19=X20,X20=0),X21,X20)","v":""},"","","",0,0,0,0,0,0,0,0,0,0,0,0,0]
{"$rows_left_out":298}
{"sheet":"Full2","index":2,"n_rows":25,"n_cols":4,"rows_kept":25,"cut":false,"hidden":true,"merged":[]}
[]
[null,"Núm.","Actuació","Tipus"]
[null,1,"- Activar protocol maltractament LLEU/MODERAT","Maltractament"]
[null,2,"- Activar protocol maltractament GREU","Maltractament"]
[null,3,"- TS EAP i tutor o membre de l'equip directiu entrevista amb família\n- Valorar derivació a Hospital per a què faci exploració mèdica\n- En funció de la informació que es tingui (via: família, UDEPMI, TS hospital,...) de l'informe mèdic i l'entrevista, decidir si s'activa o no el protocol de maltractament greu o lleu","Maltractament"]
[null,4,"- TS EAP i tutor o membre de l'equip directiu entrevista amb família\n- En funció de l'entrevista, decidir si s'activa protocol de maltractament lleu o greu","Maltractament"]
[null,5,"- Activar protocol de mutilació genital","Mutilació genital"]
[null,6,"- Trucar al 112 si hi ha situació d'emergència\n- Contactar amb l'especialista en emergències psicosocials de l'EAP\n- Psicop. EAP entrevista amb família\n- Derivació urgent a CSMIJ o Hospital referent\n- Demanar informe psiquiàtric per si necessita acompanyament continu a casa o no","Emergències psicosocials"]
[null,7,"- Contactar amb l'especialista en emergències psicosocials de l'EAP","Emergències psicosocials"]
[null,8,"- Activació protocol violència masclista","Violència masclista"]
[null,9,"- TS EAP i tutor o membre de l'equip directiu entrevista amb família\n- En funció de l'entrevista, decidir si es tracta el cas a la Comissió Social (si es tracta d'un alumne de centre públic)  o es deriva a Serveis Socials (si es tracta d'un alumne de centre concertat) ","Valorar derivació a Serveis Socials"]
[null,10,"- Entrevista del tutor/a amb la família. Omplir, si escau, el full d'indicadors per valorar si és un cas per portar a la Comissió Social (centre públic). Valorar derivació a Serveis Socials (centre concertat)","Valorar derivació a Serveis Socials"]
[null,11,"Anar a hospital i informar a la família. En funció de la informació que es tingui (via: família, UDEPMI, TS hospital,...) de l'informe mèdic:\n- L'hospital activa el protocol GREU = activació GREU\n- L'informe només descriu les lesions però hi ha marcat l'ítem 9 = activació LLEU","Maltractament"]
[null,12,"Hi ha risc afegit"]
[null,13,"Anar a hospital i informar a la família. En funció de la informació que es tingui (via: família, UDEPMI, TS hospital,...) de l'informe mèdic:\n- L'hospital activa el protocol GREU = activació GREU\n- L'informe només descriu les lesions però hi ha marcat l'ítem 11 o l'item 12 = activació GREU","Maltractament"]
[null,14,"Anar a hospital i informar a la família. En funció de la informació que es tingui (via: família, UDEPMI, TS hospital,...) de l'informe mèdic:\n- L'hospital activa el protocol GREU = activació GREU\n- L'informe només descriu les lesions però hi ha marcat l'ítem 12 = activació GREU","Maltractament"]
[null,15,"Aplicació protocol d'assetjament. Si el maltractament està relacionat per la seva condició (sexista, discapacitat, racial, ètnica,LGBTI,...)  activar protocol d'odi i discriminació","Assetjament"]
[null,16,"La direcció del centre oferirà omplir  instancia relatant els fets i s'enviarà al CEB i s'engegaran les actuacions acordades en aquesta situació específica (DOCENT!!)","Maltractament"]
[null,17,"Valoració prioritària de l'EAP i, si escau, derivació a CSMIJ","Emergències psicosocials"]
[null,18,"Valoració prioritària de l'EAP i, si escau, derivació a SOD","Valoració EAP"]
{"$rows_left_out":6}
{"sheet":"Full3","index":3,"n_rows":27,"n_cols":7,"rows_kept":27,"cut":false,"hidden":true,"merged":[]}
[]
[]
[null,null,null,"Núm.","Accions","Tipus","Prioritat"]
[null,null,null,1,"Activació protocol maltractament greu","Maltractament"]
[null,null,null,2,"Anar a hospital i informar a la família. En funció de la informació que es tingui (via: família, UDEPMI, TS hospital,...) i de l'informe mèdic:\n- Si l'hospital activa el protocol greu = activació greu\n- Si l'hopital NO activa el protocol greu però a l'informe es descriuen les lesions = activació greu","Maltractament"]
[null,null,null,3,"La direcció del centre oferirà omplir  instancia relatant els fets i s'enviarà al CEB i s'engegaran les actuacions acordades en aquesta situació específica","Maltractament"]
[null,null,null,4,"Activació protocol maltractament lleu/moderat","Maltractament"]
[null,null,null,5,"Activació protocol maltractament lleu/moderat (Ed. Infantil i Primària)","Maltractament"]
[null,null,null,6,"Activació protocol emergències psicosocials","Emergències psicosocials"]
[null,null,null,7,"Activació protocol d'emergències psicosocials i entrevista mateix dia amb psicopedagog (EAP) referent del centre. Derivació urgent a CSMIJ o Hospital referent. Demanar informe psiquiàtric i si necessita acompayament continu a casa o no.","Emergències psicosocials"]
[null,null,null,8,"Anar a hospital i informar a la família. Si l'hospital activa el protocol greu = activació protocol maltractament greu","Maltractament"]
[null,null,null,9,"Anar a hospital i informar a la família. En funció de la informació que es tingui (via: família, UDEPMI, TS hospital,...) de l'informe mèdic:\n- L'hospital activa el protocol greu = activació greu\n- L'hospital NO activa el protocol greu però a l'informe es descriuen les lesions = activació lleu","Maltractament"]
[null,null,null,10,"Aplicació protocol d'assetjament. Si el maltractament està relacionat per la seva condició (sexista, discapacitat, racial, ètnica,LGBTI,...) activar protocol d'odi i discriminació","Assetjament"]
[null,null,null,11,"Derivació a Serveis Socials","Maltractament"]
[null,null,null,12,"Entrevista amb família per part del TS EAP i tutor i/o membre equip directiu. Valorar activació protocol maltractament o derivació a Serveis Socials","Maltractament"]
[null,null,null,13,"Entrevista del tutor/a amb la família. Omplir, si escau, el full d'indicadors per valorar si és un cas per portar a la Comissió Social (centre públic). Valorar derivació a Serveis Socials (centre concertat)","Maltractament"]
[null,null,null,14,"Entrevista el mateix dia amb la família per part de TS EAP i (tutor i/o membre equip directiu). Derivar a Hospital perquè faci informe mèdic i el porti a l'escola. Informe ha d'indicar si les ferides són per maltractament o no.","Emergències psicosocials"]
[null,null,null,15,"Hi ha risc afegit"]
[null,null,null,16,"Link protocol violència masclista","Violència masclista"]
[null,null,null,17,"No té cap acció. Igual que la resta d'items d'aquest apartat"]
{"$rows_left_out":7}